{"text_format":"1","workbook":"xlsx","n_sheets":19,"sheets":["Directions","Example Data","January","February","March","April","May","June","July","August","September","October","November","December","Trending Charts","Detail Charts","Trending Data","Drop Downs","Sheet1"],"not_rendered":{"charts":46,"images":1,"macros":1,"external_links":0,"defined_names":25,"comments":0,"pivot_tables":0},"unopened":[],"bounds":{"document_bytes":16777216,"sheet_cells":100000,"rows_first":2000,"rows_last":500,"rows_between":2000,"halvings":0,"cell_chars":16384,"cell_head_chars":4096},"cells_cut":0,"cells_raw":0,"read":"whole","date_system":"1900"}

{"sheet":"Directions","index":0,"n_rows":22,"n_cols":2,"rows_kept":22,"cut":false,"hidden":false,"merged":[[0,0,0,1]]}
["Directions"]
[1,"In the first month's worksheet, please make a complete entry (complete all applicable columns) for each resident that is taking an antipsychotic.  If the resident is taking two antipsychotics, enter each antipsychotic on a separate line. "]
[2,"Enter your end of month census in cell D1.  As you enter your residents on antipsychotics, the number of current residents on antipsychotics will automatically populate in cell G1 and your antipsychotic rate will automatically calculate in cell I1. Duplicate resident lines will be excluded from the count of current residents on antipsychotics in cell G1."]
[4,"Use the \"Populate Previous Month's Data\" button to copy the previous months data into the current month and update data from there"]
[3,"If you need to delete an entry, please highlight the cells and hit the delete key.  DO NOT DELETE THE ENTIRE ROW"]
[5,"Column D: Type of Stay - short term < 100 days, long term > 100 days"]
[6,"Column L: Diagnosis appropriate -Conditions other than dementia\nHuntington disease*\nSchizophrenia*, \nTourette’s Disorder*\n----------------------------------------------------------------------------------------------------------------------------------------------------------------------------------------------------------------------\nDelusional disorder\nHiccups (not induced by other medications)\nMedical illness with psychotic symptoms (neoplastic disease or delirium) and/or treatment related psychosis or mania (high dose steroids)\nMood disorders (bipolar, severe depression)\nNausea and vomiting associated with cancer or chemotherapy\nPsychosis in the absence of dementia\nSchizo-affective disorder, Schizophreniform disorder"]
[7,"Column N: BPSD = Behavioral or Psychological Symptoms of Dementia"]
{"$rows_left_out":15}
{"sheet":"Example Data","index":1,"n_rows":219,"n_cols":54,"rows_kept":219,"cut":false,"hidden":false,"merged":[[0,0,0,2],[0,4,0,5],[1,0,1,4],[1,5,1,21]]}
["End of Month Census :",null,null,55," Current residents on antipsychotics:",null,{"$f":"SUMPRODUCT((A4:A111<>\"\")/COUNTIF(A4:A111,A4:A111&\"\"))","v":9},"Percentage of residents on antipsychotic:",{"$f":"IFERROR((G1/D1)*100, \"---\")","v":16.363636363636363}]
["Resident Information",null,null,null,null,"Antipsychotic Medication Information"]
["Room #","Last Name","First Name","Type of Stay","Notes (New Admit, etc)","Antipsychotic Drug Prescribed","Prescriber","Dose Schedule","Date Started","Where was medication started?","Diagnosis associated with antipsychotic","Is Dx Appropriate? (See directions)","List BPSD","Appropriate BPSD documented?","List Non Drug Interventions tried","Non Drug Intv documented?","Date of most recent GDR","Outcome of GDR","GDR Needed?","Reasons for no GDR being attempted","Has resident experienced adverse drug effects?","If yes, describe adverse effects"]
["209D","Jones","Jason","long term","New Admit","Seroquel ","Dr. Stenger","Scheduled","2009-07-23","hospital","psychotic disorder","No","List all BPSD in this area","yes","List all non-drug interventions attempted","Yes","2013-10-01","Dose reduced","no","Resident on lowest possible dose","No",null,null,null,null,null,null,null,null,null,null,null,null,null,null,null,null,null,null,null,null,null,null,null,null,null,null,null,null,null,null,null,null,{"$f":"CONCATENATE(C4,B4)","v":"JasonJones"}]
["214W","Smith","Esther","long term","Readmit","seroquel","Dr. Stenger","PRN","2014-02-28","SNF","anxiety","Yes","List all BPSD in this area","yes","List all non-drug interventions attempted","Yes",null,"Drug discontinued","no","Resident on lowest possible dose","No",null,null,null,null,null,null,null,null,null,null,null,null,null,null,null,null,null,null,null,null,null,null,null,null,null,null,null,null,null,null,null,null,{"$f":"CONCATENATE(C5,B5)","v":"EstherSmith"}]
["218W","Jackson","Goldie","Long Term","Transfer from Skilled","zyprexa","Dr. Capan","Both","1905-06-30","Outpatient","psychosis","No","List all BPSD in this area","yes","List all non-drug interventions attempted","Yes","2014-10-13","Return to previous dose","no","Contraindicated per prescriber","No",null,null,null,null,null,null,null,null,null,null,null,null,null,null,null,null,null,null,null,null,null,null,null,null,null,null,null,null,null,null,null,null,"GoldieJackson"]
["208W","Brown","Frieda","long term","New Admit","seroquel","Dr. Capan","Scheduled","1905-07-03","Outpatient","anxiety","No","List all BPSD in this area","yes","List all non-drug interventions attempted","No","2014-12-13","Dose reduced","no","Other","Yes","Enter a description here",null,null,null,null,null,null,null,null,null,null,null,null,null,null,null,null,null,null,null,null,null,null,null,null,null,null,null,null,null,null,null,"FriedaBrown"]
["212W","Green","Helen","long term","Readmit","zyprexa","psych","PRN","1905-06-29","Outpatient","psychosis","No","List all BPSD in this area","yes","List all non-drug interventions attempted","Yes","2013-02-28","Dose reduced","yes","Resident on lowest possible dose","No",null,null,null,null,null,null,null,null,null,null,null,null,null,null,null,null,null,null,null,null,null,null,null,null,null,null,null,null,null,null,null,null,"HelenGreen"]
{"$rows_left_out":212}
{"sheet":"January","index":2,"n_rows":217,"n_cols":54,"rows_kept":217,"cut":false,"hidden":false,"merged":[[0,0,0,2],[0,4,0,5],[1,0,1,4],[1,5,1,21]]}
["End of Month Census :",null,null,50," Current residents on antipsychotics:",null,{"$f":"SUMPRODUCT((A4:A111<>\"\")/COUNTIF(A4:A111,A4:A111&\"\"))","v":0},"Percentage of residents on antipsychotic:",{"$f":"IFERROR((G1/D1)*100, \"---\")","v":0}]
["Resident Information",null,null,null,null,"Antipsychotic Medication Information"]
["Room #","Last Name","First Name","Type of Stay","Notes (New Admit, etc)","Antipsychotic Drug Prescribed","Prescriber","Dose Schedule","Date Started","Where was medication started?","Diagnosis associated with antipsychotic","Is Dx Appropriate? (See directions)","List BPSD","Appropriate BPSD documented?","List Non Drug Interventions tried","Non Drug Intv documented?","Date of most recent GDR","Outcome of GDR","GDR Needed?","Reasons for no GDR being attempted","Has resident experienced adverse drug effects?","If yes, describe adverse effects"]
[]
[]
[]
[]
[]
{"$rows_left_out":210}
{"sheet":"February","index":3,"n_rows":217,"n_cols":54,"rows_kept":217,"cut":false,"hidden":false,"merged":[[0,0,0,2],[0,4,0,5],[1,0,1,4],[1,5,1,21]]}
["End of Month Census :",null,null,null," Current residents on antipsychotics:",null,{"$f":"SUMPRODUCT((A4:A111<>\"\")/COUNTIF(A4:A111,A4:A111&\"\"))","v":0},"Percentage of residents on antipsychotic:",{"$f":"IFERROR((G1/D1)*100, \"---\")","v":"---"}]
["Resident Information",null,null,null,null,"Antipsychotic Medication Information"]
["Room #","Last Name","First Name","Type of Stay","Notes (New Admit, etc)","Antipsychotic Drug Prescribed","Prescriber","Dose Schedule","Date Started","Where was medication started?","Diagnosis associated with antipsychotic","Is Dx Appropriate? (See directions)","List BPSD","Appropriate BPSD documented?","List Non Drug Interventions tried","Non Drug Intv documented?","Date of most recent GDR","Outcome of GDR","GDR Needed?","Reasons for no GDR being attempted","Has resident experienced adverse drug effects?","If yes, describe adverse effects"]
[]
[]
[]
[]
[]
{"$rows_left_out":210}
{"sheet":"March","index":4,"n_rows":217,"n_cols":54,"rows_kept":217,"cut":false,"hidden":false,"merged":[[0,0,0,2],[0,4,0,5],[1,0,1,4],[1,5,1,21]]}
["End of Month Census :",null,null,null," Current residents on antipsychotics:",null,{"$f":"SUMPRODUCT((A4:A111<>\"\")/COUNTIF(A4:A111,A4:A111&\"\"))","v":0},"Percentage of residents on antipsychotic:",{"$f":"IFERROR((G1/D1)*100, \"---\")","v":"---"}]
["Resident Information",null,null,null,null,"Antipsychotic Medication Information"]
["Room #","Last Name","First Name","Type of Stay","Notes (New Admit, etc)","Antipsychotic Drug Prescribed","Prescriber","Dose Schedule","Date Started","Where was medication started?","Diagnosis associated with antipsychotic","Is Dx Appropriate? (See directions)","List BPSD","Appropriate BPSD documented?","List Non Drug Interventions tried","Non Drug Intv documented?","Date of most recent GDR","Outcome of GDR","GDR Needed?","Reasons for no GDR being attempted","Has resident experienced adverse drug effects?","If yes, describe adverse effects"]
[]
[]
[]
[]
[]
{"$rows_left_out":210}
{"sheet":"April","index":5,"n_rows":217,"n_cols":54,"rows_kept":217,"cut":false,"hidden":false,"merged":[[0,0,0,2],[0,4,0,5],[1,0,1,4],[1,5,1,21]]}
["End of Month Census :",null,null,null," Current residents on antipsychotics:",null,{"$f":"SUMPRODUCT((A4:A111<>\"\")/COUNTIF(A4:A111,A4:A111&\"\"))","v":0},"Percentage of residents on antipsychotic:",{"$f":"IFERROR((G1/D1)*100, \"---\")","v":"---"}]
["Resident Information",null,null,null,null,"Antipsychotic Medication Information"]
["Room #","Last Name","First Name","Type of Stay","Notes (New Admit, etc)","Antipsychotic Drug Prescribed","Prescriber","Dose Schedule","Date Started","Where was medication started?","Diagnosis associated with antipsychotic","Is Dx Appropriate? (See directions)","List BPSD","Appropriate BPSD documented?","List Non Drug Interventions tried","Non Drug Intv documented?","Date of most recent GDR","Outcome of GDR","GDR Needed?","Reasons for no GDR being attempted","Has resident experienced adverse drug effects?","If yes, describe adverse effects"]
[]
[]
[]
[]
[]
{"$rows_left_out":210}
{"sheet":"May","index":6,"n_rows":217,"n_cols":54,"rows_kept":217,"cut":false,"hidden":false,"merged":[[0,0,0,2],[0,4,0,5],[1,0,1,4],[1,5,1,21]]}
["End of Month Census :",null,null,null," Current residents on antipsychotics:",null,{"$f":"SUMPRODUCT((A4:A111<>\"\")/COUNTIF(A4:A111,A4:A111&\"\"))","v":0},"Percentage of residents on antipsychotic:",{"$f":"IFERROR((G1/D1)*100, \"---\")","v":"---"}]
["Resident Information",null,null,null,null,"Antipsychotic Medication Information"]
["Room #","Last Name","First Name","Type of Stay","Notes (New Admit, etc)","Antipsychotic Drug Prescribed","Prescriber","Dose Schedule","Date Started","Where was medication started?","Diagnosis associated with antipsychotic","Is Dx Appropriate? (See directions)","List BPSD","Appropriate BPSD documented?","List Non Drug Interventions tried","Non Drug Intv documented?","Date of most recent GDR","Outcome of GDR","GDR Needed?","Reasons for no GDR being attempted","Has resident experienced adverse drug effects?","If yes, describe adverse effects"]
[]
[]
[]
[]
[]
{"$rows_left_out":210}
{"sheet":"June","index":7,"n_rows":217,"n_cols":54,"rows_kept":217,"cut":false,"hidden":false,"merged":[[0,0,0,2],[0,4,0,5],[1,0,1,4],[1,5,1,21]]}
["End of Month Census :",null,null,null," Current residents on antipsychotics:",null,{"$f":"SUMPRODUCT((A4:A111<>\"\")/COUNTIF(A4:A111,A4:A111&\"\"))","v":0},"Percentage of residents on antipsychotic:",{"$f":"IFERROR((G1/D1)*100, \"---\")","v":"---"}]
["Resident Information",null,null,null,null,"Antipsychotic Medication Information"]
["Room #","Last Name","First Name","Type of Stay","Notes (New Admit, etc)","Antipsychotic Drug Prescribed","Prescriber","Dose Schedule","Date Started","Where was medication started?","Diagnosis associated with antipsychotic","Is Dx Appropriate? (See directions)","List BPSD","Appropriate BPSD documented?","List Non Drug Interventions tried","Non Drug Intv documented?","Date of most recent GDR","Outcome of GDR","GDR Needed?","Reasons for no GDR being attempted","Has resident experienced adverse drug effects?","If yes, describe adverse effects"]
[]
[]
[]
[]
[]
{"$rows_left_out":210}
{"sheet":"July","index":8,"n_rows":217,"n_cols":54,"rows_kept":217,"cut":false,"hidden":false,"merged":[[1,0,1,4],[1,5,1,21],[0,0,0,2],[0,4,0,5]]}
["End of Month Census :",null,null,null," Current residents on antipsychotics:",null,{"$f":"SUMPRODUCT((A4:A111<>\"\")/COUNTIF(A4:A111,A4:A111&\"\"))","v":0},"Percentage of residents on antipsychotic:",{"$f":"IFERROR((G1/D1)*100, \"---\")","v":"---"}]
["Resident Information",null,null,null,null,"Antipsychotic Medication Information"]
["Room #","Last Name","First Name","Type of Stay","Notes (New Admit, etc)","Antipsychotic Drug Prescribed","Prescriber","Dose Schedule","Date Started","Where was medication started?","Diagnosis associated with antipsychotic","Is Dx Appropriate? (See directions)","List BPSD","Appropriate BPSD documented?","List Non Drug Interventions tried","Non Drug Intv documented?","Date of most recent GDR","Outcome of GDR","GDR Needed?","Reasons for no GDR being attempted","Has resident experienced adverse drug effects?","If yes, describe adverse effects"]
[]
[]
[]
[]
[]
{"$rows_left_out":210}
{"sheet":"August","index":9,"n_rows":217,"n_cols":22,"rows_kept":217,"cut":false,"hidden":false,"merged":[[1,0,1,4],[1,5,1,21],[0,0,0,2],[0,4,0,5]]}
["End of Month Census :",null,null,null,"Current residents on antipsychotics:",null,{"$f":"SUMPRODUCT((A4:A112<>\"\")/COUNTIF(A4:A112,A4:A112&\"\"))","v":0},"Percentage of residents on antipsychotic:",{"$f":"IFERROR((G1/D1)*100, \"---\")","v":"---"}]
["Resident Information",null,null,null,null,"Antipsychotic Medication Information"]
["Room #","Last Name","First Name","Type of Stay","Notes (New Admit, etc)","Antipsychotic Drug Prescribed","Prescriber","Dose Schedule","Date Started","Where was medication started?","Diagnosis associated with antipsychotic","Is Dx Appropriate? (See directions)","List BPSD","Appropriate BPSD documented?","List Non Drug Interventions tried","Non Drug Intv documented?","Date of most recent GDR","Outcome of GDR","GDR Needed?","Reasons for no GDR being attempted","Has resident experienced adverse drug effects?","If yes, describe adverse effects"]
[]
[]
[]
[]
[]
{"$rows_left_out":210}
{"sheet":"September","index":10,"n_rows":217,"n_cols":22,"rows_kept":217,"cut":false,"hidden":false,"merged":[[1,0,1,4],[1,5,1,21],[0,0,0,2],[0,4,0,5]]}
["End of Month Census :",null,null,null,"Current residents on antipsychotics:",null,{"$f":"SUMPRODUCT((A4:A112<>\"\")/COUNTIF(A4:A112,A4:A112&\"\"))","v":0},"Percentage of residents on antipsychotic:",{"$f":"IFERROR((G1/D1)*100, \"---\")","v":"---"}]
["Resident Information",null,null,null,null,"Antipsychotic Medication Information"]
["Room #","Last Name","First Name","Type of Stay","Notes (New Admit, etc)","Antipsychotic Drug Prescribed","Prescriber","Dose Schedule","Date Started","Where was medication started?","Diagnosis associated with antipsychotic","Is Dx Appropriate? (See directions)","List BPSD","Appropriate BPSD documented?","List Non Drug Interventions tried","Non Drug Intv documented?","Date of most recent GDR","Outcome of GDR","GDR Needed?","Reasons for no GDR being attempted","Has resident experienced adverse drug effects?","If yes, describe adverse effects"]
[]
[]
[]
[]
[]
{"$rows_left_out":210}
{"sheet":"October","index":11,"n_rows":217,"n_cols":22,"rows_kept":217,"cut":false,"hidden":false,"merged":[[1,0,1,4],[1,5,1,21],[0,0,0,2],[0,4,0,5]]}
["End of Month Census :",null,null,null,"Current residents on antipsychotics:",null,{"$f":"SUMPRODUCT((A4:A112<>\"\")/COUNTIF(A4:A112,A4:A112&\"\"))","v":0},"Percentage of residents on antipsychotic:",{"$f":"IFERROR((G1/D1)*100, \"---\")","v":"---"}]
["Resident Information",null,null,null,null,"Antipsychotic Medication Information"]
["Room #","Last Name","First Name","Type of Stay","Notes (New Admit, etc)","Antipsychotic Drug Prescribed","Prescriber","Dose Schedule","Date Started","Where was medication started?","Diagnosis associated with antipsychotic","Is Dx Appropriate? (See directions)","List BPSD","Appropriate BPSD documented?","List Non Drug Interventions tried","Non Drug Intv documented?","Date of most recent GDR","Outcome of GDR","GDR Needed?","Reasons for no GDR being attempted","Has resident experienced adverse drug effects?","If yes, describe adverse effects"]
[]
[]
[]
[]
[]
{"$rows_left_out":210}
{"sheet":"November","index":12,"n_rows":217,"n_cols":22,"rows_kept":217,"cut":false,"hidden":false,"merged":[[1,0,1,4],[1,5,1,21],[0,0,0,2],[0,4,0,5]]}
["End of Month Census :",null,null,null,"Current residents on antipsychotics:",null,{"$f":"SUMPRODUCT((A4:A112<>\"\")/COUNTIF(A4:A112,A4:A112&\"\"))","v":0},"Percentage of residents on antipsychotic:",{"$f":"IFERROR((G1/D1)*100, \"---\")","v":"---"}]
["Resident Information",null,null,null,null,"Antipsychotic Medication Information"]
["Room #","Last Name","First Name","Type of Stay","Notes (New Admit, etc)","Antipsychotic Drug Prescribed","Prescriber","Dose Schedule","Date Started","Where was medication started?","Diagnosis associated with antipsychotic","Is Dx Appropriate? (See directions)","List BPSD","Appropriate BPSD documented?","List Non Drug Interventions tried","Non Drug Intv documented?","Date of most recent GDR","Outcome of GDR","GDR Needed?","Reasons for no GDR being attempted","Has resident experienced adverse drug effects?","If yes, describe adverse effects"]
[]
[]
[]
[]
[]
{"$rows_left_out":210}
{"sheet":"December","index":13,"n_rows":217,"n_cols":22,"rows_kept":217,"cut":false,"hidden":false,"merged":[[1,0,1,4],[1,5,1,21],[0,0,0,2],[0,4,0,5]]}
["End of Month Census :",null,null,null,"Current residents on antipsychotics:",null,{"$f":"SUMPRODUCT((A4:A112<>\"\")/COUNTIF(A4:A112,A4:A112&\"\"))","v":0},"Percentage of residents on antipsychotic:",{"$f":"IFERROR((G1/D1)*100, \"---\")","v":"---"}]
["Resident Information",null,null,null,null,"Antipsychotic Medication Information"]
["Room #","Last Name","First Name","Type of Stay","Notes (New Admit, etc.)","Antipsychotic Drug Prescribed","Prescriber","Dose Schedule","Date Started","Where was medication started?","Diagnosis associated with antipsychotic","Is Dx Appropriate? (See directions)","List BPSD","Appropriate BPSD documented?","List Non Drug Interventions tried","Non Drug Intv documented?","Date of most recent GDR","Outcome of GDR","GDR Needed?","Reasons for no GDR being attempted","Has resident experienced adverse drug effects?","If yes, describe adverse effects"]
[]
[]
[]
[]
[]
{"$rows_left_out":210}
{"sheet":"Trending Charts","index":14,"n_rows":0,"n_cols":0,"rows_kept":0,"cut":false,"hidden":false,"merged":[]}

{"sheet":"Detail Charts","index":15,"n_rows":0,"n_cols":0,"rows_kept":0,"cut":false,"hidden":false,"merged":[]}

{"sheet":"Trending Data","index":16,"n_rows":107,"n_cols":14,"rows_kept":107,"cut":false,"hidden":true,"merged":[]}
["Antipsychotic","Totals","Jan","Feb","March","April","May","June","Jul","Aug","Sept","Oct","Nov","Dec"]
["Type of Stay","Short Stay",{"$f":"IFERROR((January!$B$120),\"---\")","v":0},{"$f":"IFERROR((February!$B$120),\"---\")","v":0},{"$f":"IFERROR((March!$B$120),\"---\")","v":0},{"$f":"IFERROR((April!$B$120),\"---\")","v":0},{"$f":"IFERROR((May!$B$120),\"---\")","v":0},{"$f":"IFERROR((June!$B$120),\"---\")","v":0},{"$f":"IFERROR((July!$B$120),\"---\")","v":0},{"$f":"IFERROR((August!$B$120),\"---\")","v":0},{"$f":"IFERROR((September!$B$120),\"---\")","v":0},{"$f":"IFERROR((October!$B$120),\"---\")","v":0},{"$f":"IFERROR((November!$B$120),\"---\")","v":0},{"$f":"IFERROR((December!$B$120),\"---\")","v":0}]
["Type of Stay","Long Stay",{"$f":"IFERROR((January!$B$121),\"---\")","v":0},{"$f":"IFERROR((February!$B$121),\"---\")","v":0},{"$f":"IFERROR((March!$B$121),\"---\")","v":0},{"$f":"IFERROR((April!$B$121),\"---\")","v":0},{"$f":"IFERROR((May!$B$121),\"---\")","v":0},{"$f":"IFERROR((June!$B$121),\"---\")","v":0},{"$f":"IFERROR((July!$B$121),\"---\")","v":0},{"$f":"IFERROR((August!$B$121),\"---\")","v":0},{"$f":"IFERROR((September!$B$121),\"---\")","v":0},{"$f":"IFERROR((October!$B$121),\"---\")","v":0},{"$f":"IFERROR((November!$B$121),\"---\")","v":0},{"$f":"IFERROR((December!$B$121),\"---\")","v":0}]
["Type of Stay","Total",{"$f":"IFERROR((January!$B$122),\"---\")","v":0},{"$f":"IFERROR((February!$B$122),\"---\")","v":0},{"$f":"IFERROR((March!$B$122),\"---\")","v":0},{"$f":"IFERROR((April!$B$122),\"---\")","v":0},{"$f":"IFERROR((May!$B$122),\"---\")","v":0},{"$f":"IFERROR((June!$B$122),\"---\")","v":0},{"$f":"IFERROR((July!$B$122),\"---\")","v":0},{"$f":"IFERROR((August!$B$122),\"---\")","v":0},{"$f":"IFERROR((September!$B$122),\"---\")","v":0},{"$f":"IFERROR((October!$B$122),\"---\")","v":0},{"$f":"IFERROR((November!$B$122),\"---\")","v":0},{"$f":"IFERROR((December!$B$122),\"---\")","v":0}]
["Dose Scheduled","Short Stay",{"$f":"IFERROR((January!$C$127),\"---\")","v":0},{"$f":"IFERROR((February!$C$127),\"---\")","v":0},{"$f":"IFERROR((March!$C$127),\"---\")","v":0},{"$f":"IFERROR((April!$C$127),\"---\")","v":0},{"$f":"IFERROR((May!$C$127),\"---\")","v":0},{"$f":"IFERROR((June!$C$127),\"---\")","v":0},{"$f":"IFERROR((July!$C$127),\"---\")","v":0},{"$f":"IFERROR((August!$C$127),\"---\")","v":0},{"$f":"IFERROR((September!$C$127),\"---\")","v":0},{"$f":"IFERROR((October!$C$127),\"---\")","v":0},{"$f":"IFERROR((November!$C$127),\"---\")","v":0},{"$f":"IFERROR((December!$C$127),\"---\")","v":0}]
["Dose Scheduled","Long Stay",{"$f":"IFERROR((January!$D$127),\"---\")","v":0},{"$f":"IFERROR((February!$D$127),\"---\")","v":0},{"$f":"IFERROR((March!$D$127),\"---\")","v":0},{"$f":"IFERROR((April!$D$127),\"---\")","v":0},{"$f":"IFERROR((May!$D$127),\"---\")","v":0},{"$f":"IFERROR((June!$D$127),\"---\")","v":0},{"$f":"IFERROR((July!$D$127),\"---\")","v":0},{"$f":"IFERROR((August!$D$127),\"---\")","v":0},{"$f":"IFERROR((September!$D$127),\"---\")","v":0},{"$f":"IFERROR((October!$D$127),\"---\")","v":0},{"$f":"IFERROR((November!$D$127),\"---\")","v":0},{"$f":"IFERROR((December!$D$127),\"---\")","v":0}]
["Dose Scheduled","Total",{"$f":"IFERROR((January!$B$127),\"---\")","v":0},{"$f":"IFERROR((February!$B$127),\"---\")","v":0},{"$f":"IFERROR((March!$B$127),\"---\")","v":0},{"$f":"IFERROR((April!$B$127),\"---\")","v":0},{"$f":"IFERROR((May!$B$127),\"---\")","v":0},{"$f":"IFERROR((June!$B$127),\"---\")","v":0},{"$f":"IFERROR((July!$B$127),\"---\")","v":0},{"$f":"IFERROR((August!$B$127),\"---\")","v":0},{"$f":"IFERROR((September!$B$127),\"---\")","v":0},{"$f":"IFERROR((October!$B$127),\"---\")","v":0},{"$f":"IFERROR((November!$B$127),\"---\")","v":0},{"$f":"IFERROR((December!$B$127),\"---\")","v":0}]
["% Scheduled","Short Stay",{"$f":"IFERROR((January!$C$131),\"---\")","v":"---"},{"$f":"IFERROR((February!$C$131),\"---\")","v":"---"},{"$f":"IFERROR((March!$C$131),\"---\")","v":"---"},{"$f":"IFERROR((April!$C$131),\"---\")","v":"---"},{"$f":"IFERROR((May!$C$131),\"---\")","v":"---"},{"$f":"IFERROR((June!$C$131),\"---\")","v":"---"},{"$f":"IFERROR((July!$C$131),\"---\")","v":"---"},{"$f":"IFERROR((August!$C$131),\"---\")","v":"---"},{"$f":"IFERROR((September!$C$131),\"---\")","v":"---"},{"$f":"IFERROR((October!$C$131),\"---\")","v":"---"},{"$f":"IFERROR((November!$C$131),\"---\")","v":"---"},{"$f":"IFERROR((December!$C$131),\"---\")","v":"---"}]
{"$rows_left_out":100}
{"sheet":"Drop Downs","index":17,"n_rows":5,"n_cols":8,"rows_kept":5,"cut":false,"hidden":true,"merged":[]}
["YN","X","YNNA","Sched","Stay Type","Where Started","GDROutcome","NoGDR"]
["Yes","X","Yes","Scheduled","Long Term","SNF","Dose reduced","N/A"]
["No","X","No","PRN","Short Term","Hospital","Drug discontinued","Resident on lowest possible dose"]
[null,null,"N/A","Both",null,"Outpatient","Return to previous dose","Contraindicated per prescriber"]
[null,null,null,null,null,null,null,"Other"]

{"sheet":"Sheet1","index":18,"n_rows":0,"n_cols":0,"rows_kept":0,"cut":false,"hidden":false,"merged":[]}